﻿"Dublin Core:Title","Dublin Core:Identifier","Dublin Core:Source","Dublin Core:Description","Dublin Core:Creator","Dublin Core:Date","Dublin Core:Format","Dublin Core:Subject","Dublin Core:Coverage","Dublin Core:Relation","Dublin Core:Publisher","Dublin Core:Rights","Dublin Core:Type","Dublin Core:Language","Dublin Core:References","Dublin Core:Is Referenced By","Dublin Core:Contributor","Dublin Core:Alternative Title","Dublin Core:Abstract","Dublin Core:Table Of Contents","Dublin Core:Date Available","Dublin Core:Date Created","Dublin Core:Date Accepted","Dublin Core:Date Copyrighted","Dublin Core:Date Submitted","Dublin Core:Date Issued","Dublin Core:Date Modified","Dublin Core:Date Valid","Dublin Core:Access Rights","Dublin Core:License","Dublin Core:Conforms To","Dublin Core:Has Format","Dublin Core:Has Part","Dublin Core:Has Version","Dublin Core:Is Format Of","Dublin Core:Is Part Of","Dublin Core:Is Replaced By","Dublin Core:Is Required By","Dublin Core:Is Version Of","Dublin Core:Replaces","Dublin Core:Requires","Dublin Core:Extent","Dublin Core:Medium","Dublin Core:Bibliographic Citation","Dublin Core:Spatial Coverage","Dublin Core:Temporal Coverage","Dublin Core:Accrual Method","Dublin Core:Accrual Periodicity","Dublin Core:Accrual Policy","Dublin Core:Audience","Dublin Core:Audience Education Level","Dublin Core:Mediator","Dublin Core:Instructional Method","Dublin Core:Provenance","Dublin Core:Rights Holder","Item Type Metadata:Text","Item Type Metadata:Interviewer","Item Type Metadata:Interviewee","Item Type Metadata:Location","Item Type Metadata:Transcription","Item Type Metadata:Local URL","Item Type Metadata:Original Format","Item Type Metadata:Physical Dimensions","Item Type Metadata:Duration","Item Type Metadata:Compression","Item Type Metadata:Producer","Item Type Metadata:Director","Item Type Metadata:Bit Rate/Frequency","Item Type Metadata:Time Summary","Item Type Metadata:Email Body","Item Type Metadata:Subject Line","Item Type Metadata:From","Item Type Metadata:To","Item Type Metadata:CC","Item Type Metadata:BCC","Item Type Metadata:Number of Attachments","Item Type Metadata:Standards","Item Type Metadata:Objectives","Item Type Metadata:Materials","Item Type Metadata:Lesson Plan Text","Item Type Metadata:URL","Item Type Metadata:Event Type","Item Type Metadata:Participants","Item Type Metadata:Birth Date","Item Type Metadata:Birthplace","Item Type Metadata:Death Date","Item Type Metadata:Occupation","Item Type Metadata:Biographical Text","Item Type Metadata:Bibliography","Item Type Metadata:Number of Copies",tags,file,itemType,collection,public,featured
"Survey of Portion of Subdivision 84 for Grant Line Separating Rancho Santa Paula y Saticoy and Rancho Santa Clara del Norte",MVC084-D-18-2023-01,"Martin and Associates records collection, 2014","Grey pencil survey map of a portion of Subdivision 84 showing grant line between Rancho Santa Paula y Saticoy and Rancho Santa Clara del Norte for Lloyd Corser of the Saticoy Rock Company. Visible lots include Lots 83, 84, and 85. S.P.R.R. (Southern Pacific Railroad) runs along all three lots.  Grant line runs along bottom half of map with Rancho Santa Paula y Saticoy above and Rancho Santa Clara del Norte below.","Ramelli, Milton E. (Surveyor)","1951 May"," 56.7 x 79.9 cm","Real property--Maps",California,MVC084-D-18-2023,"Museum of Ventura County","The copyright to this image has not been determined. These images are intended for personal or research use only. Please contact library staff for rights determinations and additional uses.",Image,English,,"MVC084 Martin and Associates records","Funding: Digitization funded in part by a National Historical Publications and Records Commission (NHPRC) Access to Historical Records Grant (RH-103424) awarded to the Museum of Ventura County. Funding also provided by the County of Ventura and private donors. ",,,,,,,,,,,,,,,,,,,,,,,,,,,,,,,,,,,,,,,,,,,,,,,,,,,,,,,,,,,,,,,,,,,,,,,,,,"Maps,Plats,Railroads,Ranchos",https://photographs.venturamuseum.org/files/original/e84217b126ab045f2928009c9b107afa.jpg,"Still Image","Martin and Associates",1,0
"Survey of Portion of Section 4 T4N R22W",MVC084_05-RS-64,"Martin and Associates records collection, 2014","Map showing survey of Lot for Annie Louise Hall and Ethel Bret Harte. Lot located in south half of southeast quarter of northwest quarter of Section 4 T4N R22W, San Bernardino. Showing a portion of Thacher Road and Grand Avenue and McNell Road. Smaller map to the upper right shows zoomed out view with the placement of the property highlighted. ","Dron, John A. (Surveyor)","1934 June","45 x 63 cm","Thacher Road (Ojai, Calif.)--Maps",California,,"Museum of Ventura County","The copyright to this image has not been determined. These images are intended for personal or research use only. Please contact library staff for rights determinations and additional uses.",Image,English,,"MVC084 Martin and Associates records","Funding: Digitization funded in part by a National Historical Publications and Records Commission (NHPRC) Access to Historical Records Grant (RH-103424) awarded to the Museum of Ventura County. Funding also provided by the County of Ventura and private donors.",,,,,,,,,,,,,,,,,,,,,,,,,,,,,,,,,,,,,,,,,,,,,,,,,,,,,,,,,,,,,,,,,,,,,,,,,,"Plats,Survey Maps",https://photographs.venturamuseum.org/files/original/f28b4310faa9832c14970dfb70bee90f.jpg,"Still Image","Martin and Associates",1,0
"Survey of Portion of Lots 3 & 4 of Block 14, San Buenaventura",MVC084_29-RS-58,"Martin and Associates records collection, 2014","Survey map for Sydney L. Graham showing a portion of Lots 3 & 4 of Block 14 in San Buenaventura.  Survey area is located between Front Street, South Palm Street, Beach Street, and South Oak Street.  Property within survey area is shown belonging to Gladys H. Graham and Sydney L. Graham.  Museum records indicate what is depicted as Front Street is now Harbor Boulevard. ","Lewis & Lewis","1962 February","33 x 45.7 cm","Real property--Maps",California,FB-284-17,"Museum of Ventura County","The copyright to this image has not been determined. These images are intended for personal or research use only. Please contact library staff for rights determinations and additional uses.",Image,English,,"MVC084 Martin and Associates records","Funding: Digitization funded in part by a National Historical Publications and Records Commission (NHPRC) Access to Historical Records Grant (RH-103424) awarded to the Museum of Ventura County. Funding also provided by the County of Ventura and private donors. ",,,,,,,,,,,,,,,,,,,,,,,,,,,,,,,,,,,,,,,,,,,,,,,,,,,,,,,,,,,,,,,,,,,,,,,,,,"City Blocks,Maps,Plats,Streets,Survey Maps",https://photographs.venturamuseum.org/files/original/17066dc5664b3ac20793986218ec5259.jpg,"Still Image","Martin and Associates",1,0
"Survey of Portion of Lot 27, Rancho Santa Paula y Saticoy",MVC084_06-RS-62,"Martin and Associates records collection, 2014","Map showing Survey of a portion of Lot 27 Rancho Santa Paula y Saticoy made at the request of Paul Morris (buyer) and Abraham Esparza (owner). Shows Main Street, Harvard Street, and Lot 2 Section 11 T3N R21W. Shows the Santa Paula East city limit line.","Bennett, S. G. (Surveyor)","1936 November","45.8 x 63 cm","Rancho Santa Paula y Saticoy (Calif.)--Maps",California,,"Museum of Ventura County","The copyright to this image has not been determined. These images are intended for personal or research use only. Please contact library staff for rights determinations and additional uses.",Image,English,,"MVC084 Martin and Associates records","Funding: Digitization funded in part by a National Historical Publications and Records Commission (NHPRC) Access to Historical Records Grant (RH-103424) awarded to the Museum of Ventura County. Funding also provided by the County of Ventura and private donors.",,,,,,,,,,,,,,,,,,,,,,,,,,,,,,,,,,,,,,,,,,,,,,,,,,,,,,,,,,,,,,,,,,,,,,,,,,"Plats,Survey Maps",https://photographs.venturamuseum.org/files/original/7d8eff8d98e2fe9bfae47b200c3a7218.jpg,"Still Image","Martin and Associates",1,0
"Survey of Portion of Lot 159 of the Fillmore Subdivision, Rancho Sespe",MVC084-D-18-2011-01,"Martin and Associates records collection, 2014","Survey map of a portion of Lot 159 of the Fillmore Subdivision of the Sespe Rancho. Map shows ownership of land as Elizabeth C. Thomas. Grand Avenue runs vertically along left side of the lot and an unnamed bridge is located at the top of the map. The Southern line for Lot 159 is pinpointed towards the bottom of the survey.","Martin & Associates ","1971 May"," 41 x 46 cm","Real property--Maps",California,MVC084-D-18-2011,"Museum of Ventura County","The copyright to this image has not been determined. These images are intended for personal or research use only. Please contact library staff for rights determinations and additional uses.",Image,English,,"MVC084 Martin and Associates records","Funding: Digitization funded in part by a National Historical Publications and Records Commission (NHPRC) Access to Historical Records Grant (RH-103424) awarded to the Museum of Ventura County. Funding also provided by the County of Ventura and private donors. ",,,,,,,,,,,,,,,,,,,,,,,,,,,,,,,,,,,,,,,,,,,,,,,,,,,,,,,,,,,,,,,,,,,,,,,,,,"Maps,Plats,Streets,Survey Maps",https://photographs.venturamuseum.org/files/original/50fb92e0df6e7caab46c83bb4a6c66b4.jpg,"Still Image","Martin and Associates",1,0
"Survey of Portion of Lot 10, Ojai Land Company Subdivision, Rancho Ojai",MVC084-D-19-2070-01,"Martin and Associates records collection, 2014","Grey pencil survey map conducted for Walter E. Johnson of part of a portion of Lot 10, Ojai Land Company Subdivision, Rancho Ojai with purpose of cutting lot into 3 parcels. Left of map shows Lot 39, Robinson-Fawcett Subdivision, Rancho Santa Ana. To the right of the area of survey interest is the Southern Pacific Railroad and Ventura Avenue. ","Ramelli, Milton E. (Surveyor)","1951 August","45.5 x 40.6 cm","Real property--Maps",California,"MVCO84-D-19-2070, MVCO84-D-10-817","Museum of Ventura County","The copyright to this image has not been determined. These images are intended for personal or research use only. Please contact library staff for rights determinations and additional uses.",Image,English,,"MVC084 Martin and Associates records","Funding: Digitization funded in part by a National Historical Publications and Records Commission (NHPRC) Access to Historical Records Grant (RH-103424) awarded to the Museum of Ventura County. Funding also provided by the County of Ventura and private donors. ",,,,,,,,,,,,,,,,,,,,,,,,,,,,,,,,,,,,,,,,,,,,,,,,,,,,,,,,,,,,,,,,,,,,,,,,,,"Maps,Plats,Railroads,Survey Maps",https://photographs.venturamuseum.org/files/original/0745f80b013a7d09955718282ada680e.jpg,"Still Image","Martin and Associates",1,0
"Survey of Portion of Blocks D & E, Avenue Tract, Ventura",MVC084-F2-302-09,"Martin and Associates records collection, 2014","White line on blue survey map created for People's Lumber Company of part of Blocks D & E of Avenue Tract in Ventura. Cedar Street separates Block D and Block C from Block E.  E. Prospect Street and E. Center Street are visible to the left of Cedar Street.  Block D has plot divisions numbered 9-12 and Block E has plots numbered 18-24.","Ramelli, Milton E. (Surveyor)","1938 June","33.3 x 45.5 cm","Real property--Maps",California,MVC084-F2-302,"Museum of Ventura County","The copyright to this image has not been determined. These images are intended for personal or research use only. Please contact library staff for rights determinations and additional uses.",Image,English,,"MVC084 Martin and Associates records","Funding: Digitization funded in part by a National Historical Publications and Records Commission (NHPRC) Access to Historical Records Grant (RH-103424) awarded to the Museum of Ventura County. Funding also provided by the County of Ventura and private donors. ",,,,,,,,,,,,,,,,,,,,,,,,,,,,,,,,,,,,,,,,,,,,,,,,,,,,,,,,,,,,,,,,,,,,,,,,,,"City Blocks,Maps,Plats,Streets,Survey Maps",https://photographs.venturamuseum.org/files/original/679c0244c1b76e94cc5a28b03702d784.jpg,"Still Image","Martin and Associates",1,0
"Survey of Portion of Block B, Avenue Tract, Ventura",MVC084-F2-302-08,"Martin and Associates records collection, 2014","White line on blue survey map for Capitol Co. of a portion of Block B of the Avenue Tract in Ventura.  Block B is surrounded by East Ramona Street (above), Ventura Avenue (left), and East Simpson Street (Below).  West Ramona Street is visible on left side of the map connecting to Ventura Avenue.  Lots 1 and 2 are located in the top left corner of Block B. A portion of Lot 1 is highlighted with a red line.","Ramelli, Milton E. (Surveyor)","1938 May","33 x 45.5 cm","Real property--Maps",California,MVC084-F2-302,"Museum of Ventura County","The copyright to this image has not been determined. These images are intended for personal or research use only. Please contact library staff for rights determinations and additional uses.",Image,English,,"MVC084 Martin and Associates records","Funding: Digitization funded in part by a National Historical Publications and Records Commission (NHPRC) Access to Historical Records Grant (RH-103424) awarded to the Museum of Ventura County. Funding also provided by the County of Ventura and private donors. ",,,,,,,,,,,,,,,,,,,,,,,,,,,,,,,,,,,,,,,,,,,,,,,,,,,,,,,,,,,,,,,,,,,,,,,,,,"City Blocks,Maps,Plats,Streets,Survey Maps",https://photographs.venturamuseum.org/files/original/f3772c049651a4e4bde3363d69c897b7.jpg,"Still Image","Martin and Associates",1,0
"Survey of Partition of Part of Section 30 T2N R20W, San Bernardino Meridian ",MVC084_08-RS-06,"Martin and Associates records collection, 2014","Record of Survey showing Partition of part of Section 30 T2N R20W, San Bernardino Meridian, Ventura County, Calif. Estate of Rita S. Baptiste, deceased, Owners of Record as per Ventura County Records Book 45 page 137. Shows a portion of Somis Road.","Fitzgerald, George G. (Surveyor)","1940 July","66.4 x 46 cm","Real property--Maps",California,,"Museum of Ventura County","The copyright to this image has not been determined. These images are intended for personal or research use only. Please contact library staff for rights determinations and additional uses.",Image,English,,"MVC084 Martin and Associates records","Funding: Digitization funded in part by a National Historical Publications and Records Commission (NHPRC) Access to Historical Records Grant (RH-103424) awarded to the Museum of Ventura County. Funding also provided by the County of Ventura and private donors.",,,,,,,,,,,,,,,,,,,,,,,,,,,,,,,,,,,,,,,,,,,,,,,,,,,,,,,,,,,,,,,,,,,,,,,,,,Plats,https://photographs.venturamuseum.org/files/original/ccac3d1a328bddfe8e50043f7ba706d9.jpg,"Still Image","Martin and Associates",1,0
"Survey of Partition of Part of Lot A, Replat of Daly Tract, Rancho Ojai",MVC084_08-RS-35,"Martin and Associates records collection, 2014","Record of Survey showing Partition of part of Lot A, Replat of Daly Tract (a part of Lot 15, Rancho Ojai.) For A. L. Drown and Anton Sarzotti. Shows portions of Daly Road, Grand Avenue, an unnamed road, and the Ojai city limits. ","Dron, J. A. (Surveyor)","1940 November","46 x 66.4 cm","Real property--Maps",California,,"Museum of Ventura County","The copyright to this image has not been determined. These images are intended for personal or research use only. Please contact library staff for rights determinations and additional uses.",Image,English,,"MVC084 Martin and Associates records","Funding: Digitization funded in part by a National Historical Publications and Records Commission (NHPRC) Access to Historical Records Grant (RH-103424) awarded to the Museum of Ventura County. Funding also provided by the County of Ventura and private donors.",,,,,,,,,,,,,,,,,,,,,,,,,,,,,,,,,,,,,,,,,,,,,,,,,,,,,,,,,,,,,,,,,,,,,,,,,,"Plats,Survey Maps",https://photographs.venturamuseum.org/files/original/9c7fbf136a1014c2c40b7417c97b22e4.jpg,"Still Image","Martin and Associates",1,0
"Survey of Part of U.S. Lighthouse Reservation",MVC084_06-RS-59,"Martin and Associates records collection, 2014","Record of Survey showing monuments found and set in survey of part of U.S. Lighthouse Reservation sold to Hueneme Dock Corporation. Shows the state tidelands with an indication for the mean high water as of July 2, 1934. Shows Silver Strand, Berylwood Investment Comapny, Hueneme Dock Corporation, and Parcel C Lot 1 Subdivision 87 Rancho El Rio de Santa Clara o la Colonia.","Dron, John A. (Surveyor)","1934 August","45.6 x 62.4 cm","Rancho El Rio de Santa Clara o la Colonia (Calif.)--Maps",California,,"Museum of Ventura County","The copyright to this image has not been determined. These images are intended for personal or research use only. Please contact library staff for rights determinations and additional uses.",Image,English,,"MVC084 Martin and Associates records","Funding: Digitization funded in part by a National Historical Publications and Records Commission (NHPRC) Access to Historical Records Grant (RH-103424) awarded to the Museum of Ventura County. Funding also provided by the County of Ventura and private donors.",,,,,,,,,,,,,,,,,,,,,,,,,,,,,,,,,,,,,,,,,,,,,,,,,,,,,,,,,,,,,,,,,,,,,,,,,,"Pacific Ocean,Plats,Survey Maps,Tidelands",https://photographs.venturamuseum.org/files/original/a872e9e1117e0d4d38ebedad9515eca9.jpg,"Still Image","Martin and Associates",1,0
"Survey of Part of Tracts A & C, Rancho Santa Ana",MVC084_06-RS-73,"Martin and Associates records collection, 2014","O. T. Littlefield Map showing survey of 8.513 acre parcel part of Tracts A and C Rancho Santa Ana. Shows a portion of Sulphur Mountain Road and a portion of Creek Road. Shows property belonging to Thomas A. Langford and O. T. Littlefield. Shows the border between Rancho Santa Ana and Rancho Ex Mission.","Lewis, R. B. (Surveyor)",1937-02-05,"45.6 x 66 cm","Rancho Santa Ana (Calif.)--Maps",California,FB-196-26,"Museum of Ventura County","The copyright to this image has not been determined. These images are intended for personal or research use only. Please contact library staff for rights determinations and additional uses.",Image,English,,"MVC084 Martin and Associates records","Funding: Digitization funded in part by a National Historical Publications and Records Commission (NHPRC) Access to Historical Records Grant (RH-103424) awarded to the Museum of Ventura County. Funding also provided by the County of Ventura and private donors.",,,,,,,,,,,,,,,,,,,,,,,,,,,,,,,,,,,,,,,,,,,,,,,,,,,,,,,,,,,,,,,,,,,,,,,,,,"Plats,Survey Maps",https://photographs.venturamuseum.org/files/original/31f228fe4aecc738ac9a382df380af38.jpg,"Still Image","Martin and Associates",1,0
"Survey of Part of Tract G, Rancho Simi and Part of Santa Rosa Rancho",MVC084-D-19-2150-04,"Martin and Associates records collection, 2014","Survey map of Rancho Simi Tract G, located immediately north of Camarillo Road. A section of land in the northwest corner of the tract is delineated in red pencil. Shows portions of adjacent Tracts F and M. Survey points and data are indicated along the property lines as well as along Camarillo Road. Pipeline, well-site, dam, and road easements are shown. There is a table of data related to pipeline easements. Grant line between Rancho Simi and Rancho El Conejo is indicated. ","Martin, Robert E. (Surveyor) ","1959 April","92 x 122 cm","Real property--Maps",California,MVC084-D-19-2150,"Museum of Ventura County","The copyright to this image has not been determined. These images are intended for personal or research use only. Please contact library staff for rights determinations and additional uses.",Image,English,,"MVC084 Martin and Associates records","Funding: Digitization funded in part by a National Historical Publications and Records Commission (NHPRC) Access to Historical Records Grant (RH-103424) awarded to the Museum of Ventura County. Funding also provided by the County of Ventura and private donors. ",,,,,,,,,,,,,,,,,,,,,,,,,,,,,,,,,,,,,,,,,,,,,,,,,,,,,,,,,,,,,,,,,,,,,,,,,,"Dams,Easements,Maps,Pipelines,Plats,Roads,Wells",https://photographs.venturamuseum.org/files/original/2555307df6a1f443b177ed33d27665be.jpg,"Still Image","Martin and Associates",1,0
"Survey of Part of Tract G, Rancho Simi and a Part of Santa Rosa Rancho",MVC084-D-19-2150-05,"Martin and Associates records collection, 2014","Survey map of Rancho Simi Tract G, located immediately north of Camarillo Road. Shows portions of adjacent Tracts F and M. Survey points and data are indicated along the property lines as well as along Camarillo Road. Pipeline, well-site, dam, and road easements are shown. There is a table of data related to pipeline easements. Parcels 3 to 8 are noted in black pencil. Grant line between Rancho Simi and Rancho El Conejo is indicated.","Martin, Robert E.  (Surveyor)","1959 April","92 x 122 cm","Real property--Maps",California,"MVC084-D-19-2150, MVC084-D-19-2150-04","Museum of Ventura County","The copyright to this image has not been determined. These images are intended for personal or research use only. Please contact library staff for rights determinations and additional uses.",Image,English,,"MVC084 Martin and Associates records","Funding: Digitization funded in part by a National Historical Publications and Records Commission (NHPRC) Access to Historical Records Grant (RH-103424) awarded to the Museum of Ventura County. Funding also provided by the County of Ventura and private donors. ",,,,,,,,,,,,,,,,,,,,,,,,,,,,,,,,,,,,,,,,,,,,,,,,,,,,,,,,,,,,,,,,,,,,,,,,,,"Easements,Maps,Pipelines,Plats,Roads,Wells",https://photographs.venturamuseum.org/files/original/d77ffc19c23dbbffed343ce664004dc2.jpg,"Still Image","Martin and Associates",1,0
"Survey of Part of Tract A, Rancho Santa Ana",MVC084-F-9-684-27,"Martin and Associates records collection, 2014","Grey pencil survey map for Chismahoo Ranch of a part of Tract A of Rancho Santa Ana.  Area surveyed is 270 acres and  land around surveyed area is shown as owned by George F. Fowler and David Alison. ","Ramelli, Milton E. (Surveyor)","1950 September","31 x 38.6 cm","Real property--Maps",California,MVC084-F-9-684,"Museum of Ventura County","The copyright to this image has not been determined. These images are intended for personal or research use only. Please contact library staff for rights determinations and additional uses.",Image,English,,"MVC084 Martin and Associates records","Funding: Digitization funded in part by a National Historical Publications and Records Commission (NHPRC) Access to Historical Records Grant (RH-103424) awarded to the Museum of Ventura County. Funding also provided by the County of Ventura and private donors. ",,,,,,,,,,,,,,,,,,,,,,,,,,,,,,,,,,,,,,,,,,,,,,,,,,,,,,,,,,,,,,,,,,,,,,,,,,"Maps,Plats,Survey Maps,Tracts",https://photographs.venturamuseum.org/files/original/dda83342709a5747e921b1969e626910.jpg,"Still Image","Martin and Associates",1,0
"Survey of Part of Tract 24, Bard Subdivision, Rancho Ojai",MVC084-D-18-1992-02,"Martin and Associates records collection, 2014","Grey pencil survey map made for Allan Kempe of part of Tract 24, Bard Subdivision, Rancho Ojai. Ojai Avenue is seen running along top of map and the Siete Robles Tract is located to the left. 
